log src/vim9compile.c @ 25453:21b70bab366c v8.2.3263

age author description
Sat, 31 Jul 2021 23:00:04 +0200 Bram Moolenaar patch 8.2.3263: Vim9: "..=" does not accept same types as the ".." operator v8.2.3263
Wed, 28 Jul 2021 21:30:04 +0200 Bram Moolenaar patch 8.2.3239: Vim9: no error using heredoc for a number variable v8.2.3239
Wed, 28 Jul 2021 21:00:04 +0200 Bram Moolenaar patch 8.2.3238: Vim9: error message does not indicate the location v8.2.3238
Tue, 27 Jul 2021 22:30:03 +0200 Bram Moolenaar patch 8.2.3230: Vim9: type error when function return type is not known yet v8.2.3230
Mon, 26 Jul 2021 21:15:06 +0200 Bram Moolenaar patch 8.2.3224: cannot call script-local function after :vim9cmd v8.2.3224
Sun, 25 Jul 2021 18:15:02 +0200 Bram Moolenaar patch 8.2.3222: Vim9: cannot used loop variable later as lambda argument v8.2.3222
Sat, 24 Jul 2021 15:45:03 +0200 Bram Moolenaar patch 8.2.3210: Vim9: searchpair() sixth argument is compiled v8.2.3210
Sat, 24 Jul 2021 14:15:04 +0200 Bram Moolenaar patch 8.2.3209: Vim9: lambda doesn't find block-local variable v8.2.3209
Sat, 24 Jul 2021 13:30:04 +0200 Bram Moolenaar patch 8.2.3207: Vim9: crash when compiling string fails v8.2.3207
Fri, 23 Jul 2021 19:45:05 +0200 Bram Moolenaar patch 8.2.3205: Coverity reports a null pointer dereference v8.2.3205
Thu, 22 Jul 2021 19:15:04 +0200 Bram Moolenaar patch 8.2.3203: Vim9: compiled string expression causes type error v8.2.3203
Thu, 22 Jul 2021 15:00:05 +0200 Bram Moolenaar patch 8.2.3200: Vim9: hard to guess where a type error is given v8.2.3200
Wed, 21 Jul 2021 22:30:05 +0200 Bram Moolenaar patch 8.2.3197: error messages are spread out v8.2.3197
Wed, 21 Jul 2021 21:45:04 +0200 Bram Moolenaar patch 8.2.3196: Vim9: bool expression with numbers only fails at runtime v8.2.3196
Wed, 21 Jul 2021 20:45:04 +0200 Bram Moolenaar patch 8.2.3195: Vim9: unclear error when passing too many arguments to lambda v8.2.3195
Tue, 20 Jul 2021 22:30:05 +0200 Bram Moolenaar patch 8.2.3191: Vim9: not enough code is tested v8.2.3191
Mon, 19 Jul 2021 22:30:04 +0200 Bram Moolenaar patch 8.2.3187: Vim9: popup timer callback is not compiled v8.2.3187
Sun, 18 Jul 2021 18:30:04 +0200 Bram Moolenaar patch 8.2.3178: Vim9: the file name of an :import cannot be an expression v8.2.3178
Sat, 17 Jul 2021 21:30:04 +0200 Bram Moolenaar patch 8.2.3174: Vim9: "legacy undo" finds "undo" variable v8.2.3174
Thu, 15 Jul 2021 19:30:04 +0200 Bram Moolenaar patch 8.2.3168: Vim9: type error for constant of type any v8.2.3168
Thu, 15 Jul 2021 15:45:03 +0200 Bram Moolenaar patch 8.2.3165: Vim9: in a || expression the error line number may be wrong v8.2.3165
Sun, 11 Jul 2021 20:30:04 +0200 Bram Moolenaar patch 8.2.3151: Vim9: profiling fails if nested function is also profiled v8.2.3151
Sun, 11 Jul 2021 18:30:03 +0200 Bram Moolenaar patch 8.2.3148: Vim9: function arg type check does not handle base offset v8.2.3148
Sun, 11 Jul 2021 18:00:04 +0200 Bram Moolenaar patch 8.2.3147: Vim9: profiling does not work with a nested function v8.2.3147
Sun, 11 Jul 2021 15:30:03 +0200 Bram Moolenaar patch 8.2.3143: Vim9: wrong context if lambda called from profiled function v8.2.3143
Sat, 10 Jul 2021 19:45:04 +0200 Bram Moolenaar patch 8.2.3137: Vim9: no error when a line only has a variable name v8.2.3137
Wed, 07 Jul 2021 22:00:04 +0200 Bram Moolenaar patch 8.2.3118: Vim9: "any" type not handled correctly in for loop v8.2.3118
Wed, 07 Jul 2021 21:30:03 +0200 Bram Moolenaar patch 8.2.3117: Vim9: type not properly checked in for loop v8.2.3117
Mon, 05 Jul 2021 21:45:04 +0200 Bram Moolenaar patch 8.2.3111: Vim9: confusing error with extra whitespace before colon v8.2.3111
Sun, 04 Jul 2021 23:00:04 +0200 Bram Moolenaar patch 8.2.3106: Vim9: confusing line number reported for error v8.2.3106
Sat, 03 Jul 2021 19:00:04 +0200 Bram Moolenaar patch 8.2.3091: Vim9: default argument expr. cannot use previous argument v8.2.3091
Sat, 03 Jul 2021 13:45:04 +0200 Bram Moolenaar patch 8.2.3086: Vim9: breakpoint on "for" does not work v8.2.3086
Wed, 30 Jun 2021 20:45:04 +0200 Bram Moolenaar patch 8.2.3078: Vim9: profile test fails v8.2.3078
Sun, 27 Jun 2021 22:15:04 +0200 Bram Moolenaar patch 8.2.3069: error messages are spread out v8.2.3069
Sun, 27 Jun 2021 16:30:04 +0200 Bram Moolenaar patch 8.2.3066: Vim9: debugging lambda does not work
Sun, 27 Jun 2021 15:45:03 +0200 Bram Moolenaar patch 8.2.3065: Vim9: error when sourcing script twice and reusing function v8.2.3065
Sat, 26 Jun 2021 14:00:06 +0200 Bram Moolenaar patch 8.2.3054: Vim9: unpack assignment using "_" after semicolon fails v8.2.3054
Sat, 26 Jun 2021 13:30:04 +0200 Bram Moolenaar patch 8.2.3053: Vim9: cannot assign to @@ in :def function v8.2.3053
Sat, 26 Jun 2021 13:15:03 +0200 Bram Moolenaar patch 8.2.3052: Vim9: "legacy call" does not work v8.2.3052
Sat, 26 Jun 2021 12:45:03 +0200 Bram Moolenaar patch 8.2.3051: Vim9: for loop with one list variable does not work v8.2.3051
Fri, 25 Jun 2021 21:45:03 +0200 Bram Moolenaar patch 8.2.3048: strange error for white space after ++ command v8.2.3048
Wed, 23 Jun 2021 20:30:03 +0200 Bram Moolenaar patch 8.2.3039: Vim9: breakpoint at a comment line does not work v8.2.3039
Mon, 21 Jun 2021 19:45:03 +0200 Bram Moolenaar patch 8.2.3029: Vim9: crash when using operator and list unpack assignment v8.2.3029
Thu, 17 Jun 2021 21:15:03 +0200 Bram Moolenaar patch 8.2.3015: Vim9: Assigning to @# requires a string v8.2.3015
Wed, 16 Jun 2021 19:30:04 +0200 Bram Moolenaar patch 8.2.3011: Vim9: cannot get argument values during debugging v8.2.3011
Tue, 15 Jun 2021 22:15:03 +0200 Bram Moolenaar patch 8.2.3005: Vim9: using a void value does not give a proper error message v8.2.3005
Tue, 15 Jun 2021 11:30:03 +0200 Bram Moolenaar patch 8.2.3001: Vim9: memory leak when compilation fails v8.2.3001
Tue, 15 Jun 2021 10:30:03 +0200 Bram Moolenaar patch 8.2.3000: Vim9: warning for uninitialized variable v8.2.3000
Mon, 14 Jun 2021 20:45:03 +0200 Bram Moolenaar patch 8.2.2996: Vim9: when debugging cannot inspect local variables v8.2.2996
Sun, 13 Jun 2021 22:00:04 +0200 Bram Moolenaar patch 8.2.2994: various code is not fully tested v8.2.2994
Sun, 13 Jun 2021 15:45:02 +0200 Bram Moolenaar patch 8.2.2989: Vim9: memory leak when debugging a :def function v8.2.2989
Sun, 13 Jun 2021 14:30:03 +0200 Bram Moolenaar patch 8.2.2986: build failure without the profile feature v8.2.2986
Sun, 13 Jun 2021 14:15:04 +0200 Bram Moolenaar patch 8.2.2985: Vim9: a compiled function cannot be debugged v8.2.2985
Sat, 12 Jun 2021 18:45:03 +0200 Bram Moolenaar patch 8.2.2984: Vim9: test fails because of missing return statement v8.2.2984
Sat, 12 Jun 2021 16:00:04 +0200 Bram Moolenaar patch 8.2.2983: Vim9: an inline function requires specifying the return type v8.2.2983
Fri, 11 Jun 2021 22:15:03 +0200 Bram Moolenaar patch 8.2.2975: Vim9: can only use an autoload function name as a string v8.2.2975
Tue, 08 Jun 2021 22:15:02 +0200 Bram Moolenaar patch 8.2.2965: Vim9: crash when calling function that failed to compile v8.2.2965
Tue, 08 Jun 2021 21:00:03 +0200 Bram Moolenaar patch 8.2.2964: Vim9: hang when using space after -> v8.2.2964
Sun, 06 Jun 2021 21:45:03 +0200 Bram Moolenaar patch 8.2.2955: Vim9: using filter in compiled command does not work v8.2.2955
Sun, 06 Jun 2021 17:15:03 +0200 Bram Moolenaar patch 8.2.2951: Vim9: cannot use heredoc for :python, :lua, etc. v8.2.2951